{"text_format":"1","workbook":"xlsx","n_sheets":9,"sheets":["Directions","1-Cover","2-Constants","3-H&H","4-Soil","5-Wood","6-Single Log Design","7-Notation","Anchors"],"not_rendered":{"charts":1,"images":8,"macros":1,"external_links":0,"defined_names":43,"comments":6,"pivot_tables":0},"unopened":[],"bounds":{"document_bytes":16777216,"sheet_cells":100000,"rows_first":2000,"rows_last":500,"rows_between":2000,"halvings":0,"cell_chars":16384,"cell_head_chars":4096},"cells_cut":0,"cells_raw":0,"read":"whole","date_system":"1900"}

{"sheet":"Directions","index":0,"n_rows":146,"n_cols":16,"rows_kept":146,"cut":false,"hidden":false,"merged":[[82,11,83,15],[88,11,96,15],[0,0,0,9],[2,0,2,9],[4,0,4,9],[5,0,12,9],[13,0,13,9],[110,0,113,9],[90,1,99,9],[83,1,89,9],[78,1,80,9],[100,1,100,9],[101,1,106,9],[107,0,107,9],[108,0,109,9],[126,0,126,3],[53,0,54,9],[56,0,57,9],[59,0,63,9],[50,0,51,9],[65,0,66,9],[118,0,119,9],[122,0,122,9],[123,0,123,9],[124,0,124,9],[125,0,125,9],[73,0,77,9],[81,1,82,9],[114,0,115,9],[68,0,69,9],[121,0,121,9]]}
["Directions for LW Stability Analysis Tool"]
[]
["This design tool may be used by practitioners if they cite the developer on each sheet."]
[]
["Disclaimer:"]
["This Microsoft Excel 2010 spreadsheet tool is provided free of charge. Use this tool at your own risk. In offering this tool, the author, the U.S. Forest Service, and Colorado State University do not accept any responsibility or liability for the tool's use by third parties. This tool has specific uses and limits of applicability. Design practitioners shall take full responsibility for the final large wood structure design and performance. Designers are expected to verify the calculated values and validity of the design method. Designers should be qualified to work in river environments, and depending on the State, they may be required to be licensed as a professional engineer to design large wood structures. You cannot be sure the tool is authentic and unmolested unless downloaded from the following website:  "]
[]
[]
{"$rows_left_out":139}
{"sheet":"1-Cover","index":1,"n_rows":42,"n_cols":11,"rows_kept":42,"cut":false,"hidden":false,"merged":[[21,2,21,6],[18,10,19,13],[0,0,0,9],[2,0,2,9],[16,0,16,9],[18,2,18,6],[19,2,19,6],[20,2,20,6],[6,10,7,13],[40,0,40,9],[41,0,43,9],[22,2,22,6],[23,2,23,6],[24,2,24,6],[37,0,37,9],[38,0,38,9],[37,10,38,14],[27,3,27,5],[30,1,30,3],[30,5,30,8],[29,1,29,2],[29,5,29,6]]}
["US 101 Fisher LB Inlet Rootwad"]
[]
["Large Wood Structure Stability Analysis"]
[]
[]
[]
[null,null,null,null,null,null,null,null,null,null,"← (Optional - To change photo, right-click on image and path to new image)"]
[]
{"$rows_left_out":35}
{"sheet":"2-Constants","index":2,"n_rows":19,"n_cols":4,"rows_kept":19,"cut":false,"hidden":false,"merged":[[0,2,1,3]]}
[{"$f":"'1-Cover'!A1","v":"US 101 Fisher LB Inlet Rootwad"},null,"Spreadsheet developed by Michael Rafferty, P.E."]
["Factors of Safety and Design Constants"]
[]
["Symbol","Description","Value"]
["FSV","Factor of Safety for Vertical Force Balance",2]
["FSH","Factor of Safety for Horizontal Force Balance",2]
["FSM","Factor of Safety for Moment Force Balance",2]
[]
{"$rows_left_out":12}
{"sheet":"3-H&H","index":3,"n_rows":32,"n_cols":12,"rows_kept":32,"cut":false,"hidden":false,"merged":[[0,5,1,7],[31,9,33,17],[5,7,7,7],[5,9,7,9],[5,0,7,0],[5,4,7,4],[5,2,7,2],[5,5,7,5],[5,8,7,8],[5,3,7,3],[5,6,7,6],[5,1,7,1],[3,0,3,4]]}
[{"$f":"'1-Cover'!A1","v":"US 101 Fisher LB Inlet Rootwad"},null,null,null,null,"Spreadsheet developed by                                Michael Rafferty, P.E."]
["Hydrologic and Hydraulic Inputs"]
[]
["Average Return Interval (ARI) of Design Discharge:",null,null,null,null,100,"yr"]
[]
["Site ID","Proposed Station","Design Discharge, Qdes (cfs)","Maximum Depth, dw (ft)","Average Velocity, uavg (ft/s)","Bankfull Width, WBF (ft)","Wetted Area, AW (ft2)","Radius of Curvature, Rc (ft)","Rc/WBF","Velocity at Outer Meander Bend1, um (ft/s)"]
[]
[]
{"$rows_left_out":25}
{"sheet":"4-Soil","index":4,"n_rows":30,"n_cols":30,"rows_kept":30,"cut":false,"hidden":false,"merged":[[2,15,2,19],[3,29,5,29],[3,0,5,0],[3,2,5,2],[3,4,5,4],[3,1,5,1],[3,15,5,15],[3,16,5,16],[3,17,5,17],[3,18,5,18],[3,7,5,7],[3,9,5,9],[3,8,5,8],[3,10,5,10],[3,12,5,12],[3,11,5,11],[26,3,27,7],[0,11,1,12],[0,6,1,7],[3,28,5,28],[3,19,5,19],[3,25,5,25],[3,21,5,21],[3,22,5,22],[3,23,5,23],[3,24,5,24],[3,3,5,3],[3,5,5,5],[3,26,5,26],[3,27,5,27],[2,21,2,29],[3,6,5,6]]}
[null,null,{"$f":"'1-Cover'!A1","v":"US 101 Fisher LB Inlet Rootwad"},null,null,null,"Spreadsheet developed by Michael Rafferty, P.E.",null,{"$f":"'1-Cover'!A1","v":"US 101 Fisher LB Inlet Rootwad"},null,null,"Spreadsheet developed by Michael Rafferty, P.E."]
[null,null,"Stream Bed Substrate Properties",null,null,null,null,null,"Bank Soil Properties",null,null,null,null,null,null,"Substrate and Soil Properties Lookup Table",null,null,null,null,null,"Bank Soil Properties Lookup Table"]
[null,null,null,null,null,null,null,null,null,null,null,null,null,null,null,"General Substrate and Soil Properties1",null,null,null,null,null,"Bank Soil Properties1"]
["Site ID","Proposed Station","Stream bed D50          (mm)","Stream Bed Substrate Grain Size Class","Bed Soil Class","Dry Unit Weight1,   gbed (lb/ft3)","Buoyant Unit Weight,   g'bed (lb/ft3)","Friction Angle, fbed (deg)","Bank Soils (from field observations)","Bank Soil Class","Dry Unit Weight,   gbank (lb/ft3)","Buoyant Unit Weight, g'bank (lb/ft3)","Friction Angle, fbank (deg)",null,null,"Grain size (mm)","Stream Substrate Sediment Class","Average Dry Unit Weight,    gs (lb/ft3)","Internal Friction Angle, f (deg)","Bed Soil Class",null,"Description (from field observations)","Bank Soil Class","Probe Value (in/lb)","Average Dry Unit Weight,    gbank (lb/ft3)","Friction Angle, fbank (deg)","Void ratio2, e (Vv/Vs)","Porosity, po e/(1+e)","Saturated Unit Weight3, gbank,sat (lb/ft3)","Buoyant Unit Weight4, g'bank (lb/ft3)"]
[]
[]
[{"$f":"IF('3-H&H'!A9=\"\",\"\",'3-H&H'!A9)","v":"Fisher"},{"$f":"IF('3-H&H'!B9=\"\",\"\",'3-H&H'!B9)","v":1074},35.56,{"$f":"IF(C7=\"\",\"\",IF(C7>2048,$Q$7,IF(C7>256,$Q$8,IF(C7>128,$Q$9,IF(C7>64,$Q$10,IF(C7>32,$Q$11,IF(C7>16,$Q$12,IF(C7>8,$Q$13,IF(C7>4,$Q$14,IF(C7>2,$Q$15,IF(C7>1,$Q$16,IF(C7>0.5,$Q$17,IF(C7>0.25,$Q$18,IF(C7>0.125,$Q$19,IF(C7>0.0625,$Q$20,IF(C7>0.004,$Q$21,$Q$22))))))))))))))))","v":"Very coarse gravel"},{"$f":"IF(C7=\"\",\"\",VLOOKUP(D7,$Q$7:$T$22,4,0))","v":5},{"$f":"IF(C7=\"\",\"\",(1600+300*LOG(C7))*$E$30)","v":128.93183208174116},{"$f":"IF(D7=\"\",\"\",(((SG+((SG*SWWater/F7)-1))*SWWater)/(1+((SG*SWWater/F7)-1)))-SWWater)","v":80.278310541461451},{"$f":"IF(C7=\"\",\"\",VLOOKUP(D7,$Q$7:$T$22,3,0))","v":40},"Fine sand, dense",{"$f":"IF(I7=\"\",\"\",VLOOKUP(I7,$V$7:$Z$22,2,0))","v":6},{"$f":"IF(I7=\"\",\"\",VLOOKUP(I7,$V$7:$Z$22,4,0))","v":114},{"$f":"IF(I7=\"\",\"\",VLOOKUP(I7,$V$7:$AD$22,9,0))","v":70.981132075471692},{"$f":"IF(I7=\"\",\"\",VLOOKUP(I7,$V$7:$Z$22,5,0))","v":42},null,null,"Bedrock","Bedrock",165,"-",1,null,"Gravel/cobble",4,"400-500",{"$f":"R10","v":137},{"$f":"S10","v":41},{"$f":"((SG*SWWater)/Y7)-1","v":0.20700729927007289},{"$f":"AA7/(1+AA7)","v":0.17150459603289786},{"$f":"((SG+AA7)*SWWater)/(1+AA7)","v":147.70188679245283},{"$f":"AC7-SWWater","v":85.301886792452819}]
[{"$f":"IF('3-H&H'!A10=\"\",\"\",'3-H&H'!A10)","v":""},{"$f":"IF('3-H&H'!B10=\"\",\"\",'3-H&H'!B10)","v":""},null,"","","",{"$f":"IF(D8=\"\",\"\",(((SG+((SG*SWWater/F8)-1))*SWWater)/(1+((SG*SWWater/F8)-1)))-SWWater)","v":""},"",null,"","","","",null,null,"256-2048","Boulder",146,42,4,null,"Gravel, dense",4,"400-500",131.4,40,{"$f":"((SG*SWWater)/Y8)-1","v":0.25844748858447475},{"$f":"AA8/(1+AA8)","v":0.20537010159651661},{"$f":"((SG+AA8)*SWWater)/(1+AA8)","v":144.21509433962265},{"$f":"AC8-SWWater","v":81.815094339622647}]
{"$rows_left_out":23}
{"sheet":"5-Wood","index":5,"n_rows":130,"n_cols":33,"rows_kept":130,"cut":false,"hidden":false,"merged":[[0,20,0,25],[0,27,0,32],[64,27,64,32],[0,13,0,18],[68,20,68,25],[0,3,1,4],[61,6,61,11],[58,13,58,18],[5,0,5,2],[27,0,28,4],[17,0,19,4],[20,0,24,4],[25,6,25,11],[5,3,6,3],[5,4,6,4]]}
[{"$f":"'1-Cover'!A1","v":"US 101 Fisher LB Inlet Rootwad"},null,null,"Spreadsheet developed by Michael Rafferty, P.E.",null,null,null,null,null,null,null,null,null,"Common Trees in Great Plains Region",null,null,null,null,null,null,"Common Trees in Upper Midwest Region",null,null,null,null,null,null,"Common Trees in New England Region"]
["Large Wood Properties",null,null,null,null,null,null,null,null,null,null,null,null,"Common Name","Scientific Name","Type","SGT","gTd (lb/ft3)","gTgr (lb/ft3)",null,"Common Name","Scientific Name","Type","SGT","gTd (lb/ft3)","gTgr (lb/ft3)",null,"Common Name","Scientific Name","Type","SGT","gTd (lb/ft3)","gTgr (lb/ft3)"]
[null,null,null,null,null,null,null,null,null,null,null,null,null,"Ash, Black","Fraxinus nigra","Hardwood",0.49,{"$f":"Q3*62.4*1.12","v":34.245120000000007},52,null,"Ash, Black","Fraxinus nigra","Hardwood",0.49,{"$f":"X3*62.4*1.12","v":34.245120000000007},52,null,"Ash, Black","Fraxinus nigra","Hardwood",0.49,{"$f":"AE3*62.4*1.12","v":34.245120000000007},52]
["Project Location:","West Coast",null,null,null,null,null,null,null,null,null,null,null,"Ash, Blue","Fraxinus quadrangulata","Hardwood",0.57999999999999996,40.535040000000002,50,null,"Ash, Blue","Fraxinus quadrangulata","Hardwood",0.57999999999999996,40.535040000000002,50,null,"Ash, Green","Fraxinus pennsylvanica","Hardwood",0.56000000000000005,39.137280000000004,52]
[null,null,null,null,null,null,null,null,null,null,null,null,null,"Ash, Green","Fraxinus pennsylvanica","Hardwood",0.56000000000000005,39.137280000000004,52,null,"Ash, Green","Fraxinus pennsylvanica","Hardwood",0.56000000000000005,39.137280000000004,52,null,"Ash, White","Fraxinus americana","Hardwood",0.6,41.9328,50]
["Timber Unit Weights",null,null,"Air-dried1 gTd (lb/ft3)","Green2 gTgr (lb/ft3)",null,null,null,null,null,null,null,null,"Ash, White","Fraxinus americana","Hardwood",0.6,41.9328,50,null,"Ash, White","Fraxinus americana","Hardwood",0.6,41.9328,50,null,"Aspen, Bigtooth","Populus grandidentata","Hardwood",0.39,27.256320000000002,43]
["Selected Species","Common Name","Scientific Name",null,null,null,null,null,null,null,null,null,null,"Aspen, Bigtooth","Populus grandidentata","Hardwood",0.39,27.256320000000002,43,null,"Aspen, Bigtooth","Populus grandidentata","Hardwood",0.39,27.256320000000002,43,null,"Aspen, Quaking","Populus tremuloides","Hardwood",0.38,26.557440000000003,50]
["Tree Type #1:","Douglas-fir, Coast",{"$f":"IF($B8=\"\",\"\",IF($B$4=\"West Coast\",VLOOKUP($B8,WCTreesTable,2,0),IF($B$4=\"Mountain West\",VLOOKUP($B8,MWTreesTable,2,0),IF($B$4=\"Great Plains\",VLOOKUP($B8,GPTreesTable,2,0),IF($B$4=\"South Central\",VLOOKUP($B8,SCTreesTable,2,0),IF($B$4=\"Upper Midwest\",VLOOKUP($B8,UMWTreesTable,2,0),IF($B$4=\"Southeast\",VLOOKUP($B8,SETreesTable,2,0),IF($B$4=\"New England\",VLOOKUP($B8,NETreesTable,2,0),IF($B$4=\"Mid-Atlantic\",VLOOKUP($B8,MATreesTable,2,0),\"\")))))))))","v":"Pseudotsuga menziesii var. menzi."},{"$f":"IF($B8=\"\",\"\",IF($B$4=\"West Coast\",VLOOKUP($B8,WCTreesTable,5,0),IF($B$4=\"Mountain West\",VLOOKUP($B8,MWTreesTable,5,0),IF($B$4=\"Great Plains\",VLOOKUP($B8,GPTreesTable,5,0),IF($B$4=\"South Central\",VLOOKUP($B8,SCTreesTable,5,0),IF($B$4=\"Upper Midwest\",VLOOKUP($B8,UMWTreesTable,5,0),IF($B$4=\"Southeast\",VLOOKUP($B8,SETreesTable,5,0),IF($B$4=\"New England\",VLOOKUP($B8,NETreesTable,5,0),IF($B$4=\"Mid-Atlantic\",VLOOKUP($B8,MATreesTable,5,0),\"\")))))))))","v":33.546240000000004},{"$f":"IF($B8=\"\",\"\",IF($B$4=\"West Coast\",VLOOKUP($B8,WCTreesTable,6,0),IF($B$4=\"Mountain West\",VLOOKUP($B8,MWTreesTable,6,0),IF($B$4=\"Great Plains\",VLOOKUP($B8,GPTreesTable,6,0),IF($B$4=\"South Central\",VLOOKUP($B8,SCTreesTable,6,0),IF($B$4=\"Upper Midwest\",VLOOKUP($B8,UMWTreesTable,6,0),IF($B$4=\"Southeast\",VLOOKUP($B8,SETreesTable,6,0),IF($B$4=\"New England\",VLOOKUP($B8,NETreesTable,6,0),IF($B$4=\"Mid-Atlantic\",VLOOKUP($B8,MATreesTable,6,0),\"\")))))))))","v":38},null,null,null,null,null,null,null,null,"Aspen, Quaking","Populus tremuloides","Hardwood",0.38,26.557440000000003,50,null,"Aspen, Quaking","Populus tremuloides","Hardwood",0.38,26.557440000000003,50,null,"Balsam poplar (cottonwood)","Populus balsamifera","Hardwood",0.34,23.761920000000003,40]
{"$rows_left_out":123}
{"sheet":"6-Single Log Design","index":6,"n_rows":245,"n_cols":72,"rows_kept":245,"cut":false,"hidden":false,"merged":[[109,31,109,32],[102,31,102,32],[6,11,6,12],[7,11,7,12],[8,11,8,12],[9,11,9,12],[10,11,10,12],[11,11,11,12],[12,11,12,12],[7,18,7,20],[13,13,13,16],[75,15,75,16],[44,23,45,23],[44,25,45,25],[74,18,74,20],[44,24,45,24],[90,29,90,30],[90,31,90,32],[90,27,90,28],[102,27,102,28],[86,20,86,21],[83,19,83,23],[83,18,84,18],[85,20,85,21],[87,20,87,21],[56,0,56,4],[63,0,63,5],[27,1,27,2],[28,1,28,2],[47,1,47,2],[5,13,5,16],[6,13,6,16],[7,13,7,16],[8,13,8,16],[9,13,9,16],[10,13,10,16],[11,13,11,16],[12,13,12,16],[10,0,10,2],[23,3,23,4],[20,0,20,2],[21,0,21,2],[13,11,13,12],[22,10,23,10],[83,27,84,27],[41,34,41,38],[4,32,5,35],[5,28,5,30],[83,28,83,31],[28,18,28,22],[7,22,7,24],[17,43,17,44],[22,43,22,44],[27,43,27,44],[13,28,13,30],[33,43,33,44],[29,19,30,19],[10,28,10,30],[17,32,17,33],[22,32,22,33],[16,18,16,20],[42,34,42,40],[42,41,42,49],[54,18,54,22],[55,19,56,19],[55,20,55,23],[44,29,44,31],[90,1,90,2],[80,0,80,4],[84,0,84,9],[79,0,79,9],[64,7,64,9],[73,0,73,9],[62,0,62,9],[74,3,74,6],[67,0,67,2],[80,7,80,9],[67,3,67,5],[77,3,77,4],[4,60,4,63],[74,7,74,9],[0,8,1,9],[2,0,2,9],[4,1,4,2],[4,3,4,4],[5,1,5,2],[5,3,5,4],[52,7,52,9],[17,22,17,27],[64,26,65,26],[24,3,24,4],[23,0,24,0],[27,32,27,33],[44,26,45,26],[66,10,69,10],[4,11,4,12],[5,11,5,12],[4,43,5,46],[37,27,38,27],[38,45,38,48],[48,0,48,9],[49,0,49,5],[49,7,49,8],[107,27,107,28],[90,20,90,24],[91,14,91,25],[97,20,97,22],[91,0,91,9],[7,0,8,0],[74,0,74,2],[4,54,4,59],[5,54,5,55],[26,1,26,2],[51,13,51,14],[38,34,38,37],[33,32,33,33],[83,25,84,25],[64,21,64,22],[64,23,65,23],[64,24,65,24],[64,25,65,25],[84,20,84,21],[50,13,50,14],[37,26,38,26],[29,20,29,23],[74,22,74,30],[44,21,44,22]]}
[{"$f":"'1-Cover'!A1","v":"US 101 Fisher LB Inlet Rootwad"},null,null,null,null,null,null,null,"Spreadsheet developed by Michael Rafferty, P.E."]
[]
["Single Log Stability Analysis Model Inputs",null,null,null,null,null,null,null,null,null,"ERROR CHECKS"]
[]
["Site ID","Structure Type",null,"Structure Position",null,"Meander","Station","dw (ft)","Rc/WBF","udes (ft/s)",null,"Type Lookup Table",null,null,null,null,null,null,null,null,null,null,null,null,null,null,null,null,null,null,null,null,"Tilted Cylindrical (Stem) \"Below Water Surface\" Volume Calculation (Below High Flow)",null,null,null,null,null,null,null,null,null,null,"Tilted Cylindrical (Stem) Wet Volume Calculation (Below Channel Thalweg)",null,null,null,null,null,null,null,null,null,null,"Tilted Frustum (RW) Volume Calculation (Slice Method)",null,null,null,null,null,"A = R2 arccos [(R - h)/R] - [(R - h)*SQRT(2Rh - h2)]"]
["Fisher","Rootwad",null,"Left bank",null,"Straight",{"$f":"IF($A6=\"\",\"\",VLOOKUP($A6,SiteInfo,2,0))","v":1074},{"$f":"IF($A6=\"\",\"\",VLOOKUP($A6,SiteInfo,4,0))","v":3.8},{"$f":"IF($A6=\"\",\"\",VLOOKUP($A6,SiteInfo,9,0))","v":38.46153846153846},{"$f":"IF(OR($A$6=\"\",$F$6=\"\"),\"\",IF($F$6=\"Outside\",VLOOKUP($A$6,SiteInfo,10,0),VLOOKUP($A$6,SiteInfo,5,0)))","v":5.5},{"$f":"IF($F$6=\"\",\"\",IF(AND($I$6<26,$F$6=\"Straight\"),\"CHECK - Structure is located on a meander (Rc/WBF < 26)\",\"\"))","v":""},"Structure Types",null,"Description",null,null,null,null,null,null,null,null,null,null,null,null,null,null,"Water Surface",null,null,null,null,null,null,null,null,null,null,null,null,null,null,null,null,null,null,null,null,null,null,null,null,null,"Slice thickness (ft) =",null,{"$f":"IF($G$22=\"\",\"\",$G$22/$BC$39)","v":0.1},"WSE (ft) =",{"$f":"IF($AE$8=\"\",\"\",$AE$8)","v":3.8},"RRW (ft) =",{"$f":"IF($H$22=\"\",\"\",$H$22/2)","v":3},"yRW,crown (ft) =",{"$f":"IF($U$10=\"\",\"\",$U$10)","v":9.6401604404638359},"yRW,bot (ft) =",{"$f":"IF($U$15=\"\",\"\",$U$15)","v":3.8446054827294258}]
[null,null,null,null,null,null,null,null,null,null,{"$f":"IF(OR($F$6=\"\",$I$6=\"\"),\"\",IF(AND($I$6>26,$F$6<>\"Straight\"),\"CHECK - Structure is not on a meander (Rc/WBF > 26)\",\"\"))","v":""},"Rootwad",null,"Logs buried in bank with rootwads protruding into channel",null,null,null,null,null,null,null,null,null,null,null,null,null,null,null,"x (ft)","y (ft)",null,null,"R = DTS/2",{"$f":"$F$22/2","v":1},"ft",null,null,null,null,null,null,null,null,"R = DTS/2",{"$f":"$F$22/2","v":1},"ft",null,null,null,null,null,null,null,null,null,null,"Thalweg Elevation (ft) =",{"$f":"$C$16","v":0},"RTS (ft) =",{"$f":"IF($F$22=\"\",\"\",$F$22/2)","v":1},"yRC,crown (ft) =",{"$f":"IF($U$11=\"\",\"\",$U$11)","v":6.9318516525781382},"yRC,bot (ft) =",{"$f":"IF($U$14=\"\",\"\",$U$14)","v":5}]
["Multi-Log Structures","Layer","Log ID",null,null,null,null,null,null,null,null,"Log Vane",null,"Logs protruding from bank and angled either up- or downstream",null,null,null,null,"Large Wood Coordinates",null,null,null,null,null,null,null,null,null,"WSE",{"$f":"IF(OR($A$6=\"\",$C$16=\"\"),0,IF(($H$6+$C$16)>=$C$13,$B$13,IF(AND(($H$6+$C$16)<$C$13,($H$6+$C$16)>=$C$14),((($C$13-($H$6+$C$16))/($C$13-$C$14))*($B$14-$B$13))+$B$13,IF(AND(($H$6+$C$16)<$C$14,($H$6+$C$16)>=$C$15),((($C$14-($H$6+$C$16))/($C$14-$C$15))*($B$15-$B$14))+$B$14,IF(AND(($H$6+$C$16)<$C$15,($H$6+$C$16)>=$C$16),((($C$15-($H$6+$C$16))/($C$15-$C$16))*($B$16-$B$15))+$B$15,\"\")))))","v":-26},{"$f":"IF(OR($A$6=\"\",$C$16=\"\"),$C$13,$H$6+$C$16)","v":3.8},null,null,"b (rad)",{"$f":"ABS($C$25)*PI()/180","v":0.26179938779914941},"rad",null,null,null,null,null,null,null,null,"b (rad)",{"$f":"ABS($C$25)*PI()/180","v":0.26179938779914941},"rad"]
{"$rows_left_out":238}
{"sheet":"7-Notation","index":7,"n_rows":88,"n_cols":7,"rows_kept":88,"cut":false,"hidden":false,"merged":[[0,5,1,6]]}
[{"$f":"'1-Cover'!A1","v":"US 101 Fisher LB Inlet Rootwad"}]
["Notation, Units, and List of Symbols"]
[]
["Notation",null,null,null,"Notation (continued)"]
["Symbol","Description","Unit",null,"Symbol","Description","Unit"]
["AW","Wetted area of channel at design discharge ","ft2",null,"FV","Resultant vertical force applied to log","lbf"]
["ATp","Projected area of wood in plane perpendicular to flow","ft2",null,"FrL","Log Froude number","-"]
["cD","Centroid of the drag force along log axis","ft",null,"FSV","Factor of Safety for Vertical Force Balance","-"]
{"$rows_left_out":81}
{"sheet":"Anchors","index":8,"n_rows":43,"n_cols":25,"rows_kept":43,"cut":false,"hidden":false,"merged":[[37,0,38,1],[39,0,40,1],[41,0,41,1],[28,0,29,0],[28,1,29,1],[26,0,27,0],[26,1,27,1],[33,0,34,1],[35,0,36,1],[2,17,2,21],[3,0,4,0],[30,0,31,0],[30,1,31,1],[2,22,2,24],[9,1,10,6],[15,1,17,6],[18,1,20,6],[2,3,2,5],[2,6,2,8],[2,9,2,12],[2,13,2,16],[3,1,4,1],[3,2,4,2]]}
["Reference Sheet - Anchoring Techniques"]
[]
["Anchor Technique Lookup Table (average holding capacities)",null,null,"Manta Ray",null,null,"Stingray",null,null,"Duckbill",null,null,null,"Platipus Stealth",null,null,null,"Platipus Bat",null,null,null,null,"Custom (User Selection)"]
["Soil Class","Soil Description","Blow Count (N)","MR-1","MR-2","MR-SR","SR-1","SR-2","SR-3","DB-40","DB-68","DB-88","DB-138","P-S02","P-S04","P-S06","P-S08","P-B04T","P-B06T","P-B08T","P-B10T","P-B12T","Custom#1","Custom#2","Custom#3"]
[null,null,null,"Capacity (lb)","Capacity (lb)","Capacity (lb)","Capacity (lb)","Capacity (lb)","Capacity (lb)","Capacity (lb)","Capacity (lb)","Capacity (lb)","Capacity (lb)","Capacity (lb)","Capacity (lb)","Capacity (lb)","Capacity (lb)","Capacity (lb)","Capacity (lb)","Capacity (lb)","Capacity (lb)","Capacity (lb)","Capacity (lb)","Capacity (lb)","Capacity (lb)"]
[4,"Dense gravels; gravel/cobble; very hard silts and clays","40-100+",24000,15000,32000,39000,62000,85000,"user input","user input","user input","user input",300,1000,3500,4500,6000,11000,16500,22000,33000,"(user input)","(user input)","(user input)"]
[5,"Dense coarse sand; gravel/sand; loose gravels; stiff slits and clays","14-40",15000,9000,18000,24000,31000,48000,300,1100,3000,5000,150,600,2000,2500,3500,6500,9000,14000,20000,"(user input)","(user input)","(user input)"]
[6,"Loose coarse sand; dense fine sand; firm silts and clays","7-14",10000,7000,14000,16000,27000,37000,"user input","user input","user input","user input",50,300,800,1500,2500,4000,6500,11000,16000,"(user input)","(user input)","(user input)"]
{"$rows_left_out":35}