{"text_format":"1","workbook":"xlsx","n_sheets":31,"sheets":["Instructions","Guide","Project Info","Signature Page","Summary","Access","Barrier","Bicycle","Bridges","Clear Zone","Cross Slope","Delineation","Driveway","Horiz Align","Intersection","Lanes","Median","Pedestrian","Ramps","Rumble Strips","Shared-Use Path","Shoulder","Side Slope","Roundabout","Signals, Illum, ITS","Signing","Streetside","Vert Align","Work Zone","Blank","Form Control"],"not_rendered":{"charts":0,"images":8,"macros":1,"external_links":1,"defined_names":29,"comments":54,"pivot_tables":0},"unopened":[],"bounds":{"document_bytes":16777216,"sheet_cells":100000,"rows_first":2000,"rows_last":500,"rows_between":2000,"halvings":0,"cell_chars":16384,"cell_head_chars":4096},"cells_cut":0,"cells_raw":0,"read":"whole","date_system":"1900"}

{"sheet":"Instructions","index":0,"n_rows":20,"n_cols":2,"rows_kept":20,"cut":false,"hidden":false,"merged":[[0,0,0,14],[17,1,17,14],[17,0,19,0],[19,1,19,14],[11,0,12,0],[11,1,11,14],[12,1,12,14],[18,1,18,14],[15,1,15,14],[15,0,16,0],[16,1,16,14],[8,1,8,14],[9,1,9,14],[7,0,10,0],[13,1,13,14],[13,0,14,0],[14,1,14,14],[10,1,10,14],[7,1,7,14],[1,0,1,14],[3,1,3,14],[4,1,4,14],[5,1,5,14],[6,1,6,14],[4,0,6,0]]}
["Instructions  (2023 Version)"]
["The Design Parameter Worksheet (DPW) is intended to serve as the document that indicates if the design elements for your project meet the WSDOT Design Manual (DM).  The DPW is part of the Design Documentation Package. \n\nThis new version of the DPW is intended to make the DPW process quicker and easier by referencing the part of the DM that talks about the design parameters your project creates or changes, so that you can determine and document the correct design element dimentions for your project. \n\nThis version is in Beta. If you find anything wrong or you can suggest an improvement, please let us know."]
[]
["Step","Instruction"]
[1,"Fill out the project information on the PROJECT INFO tab: "]
[]
{"$rows_left_out":15}
{"sheet":"Guide","index":1,"n_rows":16,"n_cols":2,"rows_kept":16,"cut":false,"hidden":false,"merged":[[0,0,0,14],[3,0,3,14],[8,0,8,14],[9,0,9,14],[15,0,15,14],[2,0,2,14],[4,1,4,14],[5,0,6,0],[5,1,5,14],[6,1,6,14],[11,0,11,14],[12,0,12,14],[14,0,14,14]]}
["Hints and Tips"]
[]
["Inserting Rows"]
["You may insert rows into any of the Group Elements tabs if there are design elements that you would like to add.  There is conditional formatting and other features that will automatically be copied by Excel if you insert  a row between two existing rows.  Do not insert at the bottom, otherwise you will not get the conditional formatting.  "]
["Steps","Instructions"]
[1,"Right click on the row where you want to insert the design element and select INSERT:"]
{"$rows_left_out":11}
{"sheet":"Project Info","index":2,"n_rows":32,"n_cols":2,"rows_kept":32,"cut":false,"hidden":false,"merged":[[0,0,0,1],[6,0,6,1],[22,0,22,1],[3,0,3,1],[27,0,27,1],[1,0,1,1],[7,0,7,1],[12,0,12,1],[17,0,17,1]]}
["On this tab, you will insert your project information.  This tab will not print.  \nThe information inputted on this sheet will reflect across all sheets."]
["Fill out all applicable green highlighted cells below"]
[]
["Project Title:"]
["Project Title:","SR 999/Fake Project Title"]
[]
{"$rows_left_out":27}
{"sheet":"Signature Page","index":3,"n_rows":29,"n_cols":20,"rows_kept":29,"cut":false,"hidden":false,"merged":[[28,1,32,12],[28,13,32,25],[12,8,12,18],[26,1,26,18],[26,19,26,25],[27,13,27,25],[27,1,27,12]]}
[null,null,null,null,null,null,null,null,null,null,null,null,null,"Design Parameters Worksheet"]
[]
[null,null,null,null,null,null,null,null,null,null,null,null,null,{"$f":"'Project Info'!B5","v":"SR 999/Fake Project Title"}]
[]
[null,null,null,null,null,null,null,null,null,null,null,null,null,{"$f":"\"State Route \"&'Project Info'!B9&\", MP \"&FIXED('Project Info'!B10)&\" to MP \"&FIXED('Project Info'!B11)","v":"State Route 999, MP 0.00 to MP 999.00"}]
[null,null,null,null,null,null,null,null,null,null,null,null,null,{"$f":"IF('Project Info'!B14=0,\"\",\"State Route \" & 'Project Info'!B14 & \", MP \" & FIXED('Project Info'!B15,2) & \" to MP \" & FIXED('Project Info'!B16,2))","v":""}]
{"$rows_left_out":24}
{"sheet":"Summary","index":4,"n_rows":28,"n_cols":17,"rows_kept":28,"cut":false,"hidden":false,"merged":[[20,16,20,17],[15,7,15,15],[16,7,16,15],[17,7,17,15],[15,16,15,17],[19,16,19,17],[17,16,17,17],[18,16,18,17],[10,7,10,15],[10,16,10,17],[11,7,11,15],[12,7,12,15],[12,16,12,17],[13,16,13,17],[14,16,14,17],[13,7,13,15],[14,7,14,15],[16,16,16,17],[1,0,1,26],[9,16,9,17],[11,16,11,17],[6,7,6,15],[7,7,7,15],[8,7,8,15],[9,7,9,15],[6,16,6,17],[7,16,7,17],[8,16,8,17],[3,16,3,17],[4,16,4,17],[3,7,3,15],[4,7,4,15],[5,7,5,15],[5,16,5,17],[27,7,27,15],[18,7,18,15],[20,7,20,15],[21,7,21,15],[22,7,22,15],[23,7,23,15],[26,7,26,15],[24,7,24,15],[25,7,25,15],[19,7,19,15],[27,16,27,17],[21,16,21,17],[22,16,22,17],[23,16,23,17],[24,16,24,17],[25,16,25,17],[26,16,26,17]]}
[null,null,null,null,null,null,null,null,null,null,null,null,null,"Summary Sheet"]
["If an element group below is marked \"Yes\", this project changed something in that element group.  \nTo find out what has changed, go to that element group tab in this worksheet.  A section marked \"No\" indicates \nthe element group has either not been touched by this project or it has not been changed from its current configuration.  Yellow tabs are waiting for data from the Traffic Office. "]
[]
[null,null,null,null,null,null,null,"Element Group",null,null,null,null,null,null,null,null,"Modified?"]
[null,null,null,null,null,null,null,"Access",null,null,null,null,null,null,null,null,"No"]
[null,null,null,null,null,null,null,"Barrier",null,null,null,null,null,null,null,null,"No"]
{"$rows_left_out":23}
{"sheet":"Access","index":5,"n_rows":16,"n_cols":10,"rows_kept":16,"cut":false,"hidden":true,"merged":[[9,0,9,9],[12,0,12,9],[1,0,1,9],[3,0,3,9],[7,0,7,9]]}
[{"$f":"'Signature Page'!N3& \",  \"&'Signature Page'!N9&\",  \"&'Signature Page'!N10&\", \"&'Signature Page'!N11","v":"SR 999/Fake Project Title,  Work Order # XL1234,  WIN # A12345A, PIN # B12345B & C12345C"}]
["Access"]
["Element - Main","Element - Sub","Design Manual\nSection","Element Changed","Location","DM Requirement","Project Requirement","Design Manual Met?","Document Type","Notes"]
["General"]
["Acquiring Limited Access","Procedure","530.02(2)(a)"]
["Railroad Access","Maximum","530.09(2)"]
{"$rows_left_out":11}
{"sheet":"Barrier","index":6,"n_rows":140,"n_cols":10,"rows_kept":140,"cut":false,"hidden":true,"merged":[[132,0,132,9],[1,0,1,9],[3,0,3,9],[29,0,29,9],[66,0,66,9],[91,0,91,9],[106,0,106,9],[127,0,127,9]]}
[{"$f":"'Signature Page'!N3& \",  \"&'Signature Page'!N9&\",  \"&'Signature Page'!N10&\", \"&'Signature Page'!N11","v":"SR 999/Fake Project Title,  Work Order # XL1234,  WIN # A12345A, PIN # B12345B & C12345C"}]
["Barrier"]
["Element - Main","Element - Sub","Design Manual\nSection","Element Changed","Location","DM Requirement","Project Requirement","Design Manual Met?","Document Type","Notes"]
["General"]
["Barrier","Sight Distance Impact","1610.03(4)"]
["Barrier","Delineation",1030.05]
{"$rows_left_out":135}
{"sheet":"Bicycle","index":7,"n_rows":34,"n_cols":10,"rows_kept":34,"cut":false,"hidden":true,"merged":[[3,0,3,9],[1,0,1,9]]}
[{"$f":"'Signature Page'!N3& \",  \"&'Signature Page'!N9&\",  \"&'Signature Page'!N10&\", \"&'Signature Page'!N11","v":"SR 999/Fake Project Title,  Work Order # XL1234,  WIN # A12345A, PIN # B12345B & C12345C"}]
["Bicycle Facilities"]
["Element - Main","Element - Sub","Design Manual\nSection","Element Changed","Location","DM Requirement","Project Requirement","Design Manual Met?","Document Type","Notes"]
["General"]
["At-Grade Railroad Crossing","Width","1520.05(3)"]
["At-Grade Railroad Crossing","Skew","1520.05(3)"]
{"$rows_left_out":29}
{"sheet":"Bridges","index":8,"n_rows":42,"n_cols":10,"rows_kept":42,"cut":false,"hidden":true,"merged":[[3,0,3,9],[1,0,1,9],[26,0,26,9]]}
[{"$f":"'Signature Page'!N3& \",  \"&'Signature Page'!N9&\",  \"&'Signature Page'!N10&\", \"&'Signature Page'!N11","v":"SR 999/Fake Project Title,  Work Order # XL1234,  WIN # A12345A, PIN # B12345B & C12345C"}]
["Bridges and Buried Structures"]
["Element - Main","Element - Sub","Design Manual\nSection","Element Changed","Location","DM Requirement","Project Requirement","Design Manual Met?","Document Type","Notes"]
["General"]
["Design Load","New Structure","720.03(1)\n720.03(1)(a)"]
["General Design Principle","Width","720.03(2)"]
{"$rows_left_out":37}
{"sheet":"Clear Zone","index":9,"n_rows":24,"n_cols":10,"rows_kept":24,"cut":false,"hidden":true,"merged":[[3,0,3,9],[1,0,1,9]]}
[{"$f":"'Signature Page'!N3& \",  \"&'Signature Page'!N9&\",  \"&'Signature Page'!N10&\", \"&'Signature Page'!N11","v":"SR 999/Fake Project Title,  Work Order # XL1234,  WIN # A12345A, PIN # B12345B & C12345C"}]
["Clear Zone"]
["Element - Main","Element - Sub","Design Manual\nSection","Element Changed","Location","DM Requirement","Project Requirement","Design Manual Met?","Document Type","Notes"]
["General"]
["Managed Access \nInside Cities","Distance","1600.02(2)"]
["Managed Access \nInside Cities","City Letter","1600.02(2)(a)"]
{"$rows_left_out":19}
{"sheet":"Cross Slope","index":10,"n_rows":26,"n_cols":10,"rows_kept":26,"cut":false,"hidden":true,"merged":[[18,0,18,9],[14,0,14,9],[3,0,3,9],[1,0,1,9]]}
[{"$f":"'Signature Page'!N3& \",  \"&'Signature Page'!N9&\",  \"&'Signature Page'!N10&\", \"&'Signature Page'!N11","v":"SR 999/Fake Project Title,  Work Order # XL1234,  WIN # A12345A, PIN # B12345B & C12345C"}]
["Cross Slope"]
["Element - Main","Element - Sub","Design Manual\nSection","Element Changed","Location","DM Requirement","Project Requirement","Design Manual Met?","Document Type","Notes"]
["Lanes"]
["Preservation Project","Minimum Cross Slope","1120.02(3)"]
["Normal Crown",null,"1250.02(1)"]
{"$rows_left_out":21}
{"sheet":"Delineation","index":11,"n_rows":118,"n_cols":10,"rows_kept":118,"cut":false,"hidden":true,"merged":[[109,0,109,9],[102,0,102,9],[29,0,29,9],[9,0,9,9],[38,0,38,9],[105,0,105,9],[84,0,84,9],[94,0,94,9],[98,0,98,9],[1,0,1,9],[3,0,3,9],[52,0,52,9],[62,0,62,9],[70,0,70,9]]}
[{"$f":"'Signature Page'!N3& \",  \"&'Signature Page'!N9&\",  \"&'Signature Page'!N10&\", \"&'Signature Page'!N11","v":"SR 999/Fake Project Title,  Work Order # XL1234,  WIN # A12345A, PIN # B12345B & C12345C"}]
["Delineation"]
["Element - Main","Element - Sub","Design Manual\nSection","Element Changed","Location","DM Requirement","Project Requirement","Design Manual Met?","Document Type","Notes"]
["General"]
["ALL MARKINGS","ALL MARKINGS","MUTCD Part 3",null,null,null,null,null,null,"The MUTCD contains the national standards for all markings.  "]
["When Required",null,1030.01]
{"$rows_left_out":113}
{"sheet":"Driveway","index":12,"n_rows":30,"n_cols":10,"rows_kept":30,"cut":false,"hidden":true,"merged":[[1,0,1,9],[3,0,3,9]]}
[{"$f":"'[1]Signature Page'!N3& \",  \"&'[1]Signature Page'!N9&\",  \"&'[1]Signature Page'!N10&\", \"&'[1]Signature Page'!N11","v":"SR 999/Fake Project Title,  Work Order # XL1234,  WIN # A12345A, PIN # B12345B & C12345C"}]
["Driveway"]
["Element - Main","Element - Sub","Design Manual\nSection","Element Changed","Location","DM Requirement","Project Requirement","Design Manual Met?","Document Type","Notes"]
["General"]
["Altered, Relocated, Consolidated, or Closed","Permit",1340.02]
["New","Permit",1340.02]
{"$rows_left_out":25}
{"sheet":"Horiz Align","index":13,"n_rows":21,"n_cols":10,"rows_kept":21,"cut":false,"hidden":true,"merged":[[18,0,18,9],[1,0,1,9],[3,0,3,9],[8,0,8,9],[12,0,12,9],[10,0,11,0],[10,1,11,1]]}
[{"$f":"'Signature Page'!N3& \",  \"&'Signature Page'!N9&\",  \"&'Signature Page'!N10&\", \"&'Signature Page'!N11","v":"SR 999/Fake Project Title,  Work Order # XL1234,  WIN # A12345A, PIN # B12345B & C12345C"}]
["Horizontal Alignment"]
["Element - Main","Element - Sub","Design Manual\nSection","Element Changed","Location","DM Requirement","Project Requirement","Design Manual Met?","Document Type","Notes"]
["General"]
["General Design Principle","Multiple","1210.02(1)"]
["General Design Principle","Coordination with Vertical Curve",1210.03]
{"$rows_left_out":16}
{"sheet":"Intersection","index":14,"n_rows":118,"n_cols":10,"rows_kept":118,"cut":false,"hidden":true,"merged":[[46,0,46,9],[1,0,1,9],[3,0,3,9],[22,0,22,9],[26,0,26,9],[37,0,37,9],[103,0,103,9],[112,0,112,9],[49,0,49,9],[66,0,66,9],[75,0,75,9],[88,0,88,9],[92,0,92,9],[99,0,99,9]]}
[{"$f":"'[1]Signature Page'!N3& \",  \"&'[1]Signature Page'!N9&\",  \"&'[1]Signature Page'!N10&\", \"&'[1]Signature Page'!N11","v":"SR 999/Fake Project Title,  Work Order # XL1234,  WIN # A12345A, PIN # B12345B & C12345C"}]
["Intersections"]
["Element - Main","Element - Sub","Design Manual\nSection","Element Changed","Location","DM Requirement","Project Requirement","Design Manual Met?","Document Type","Notes"]
["General"]
["Intersection Angle",null,"1310.02(2)"]
["Angle Point","Within Intersection","1310.02(2)"]
{"$rows_left_out":113}
{"sheet":"Lanes","index":15,"n_rows":42,"n_cols":10,"rows_kept":42,"cut":false,"hidden":true,"merged":[[26,0,26,9],[15,0,15,9],[6,0,6,9],[3,0,3,9],[1,0,1,9]]}
[{"$f":"'Signature Page'!N3& \",  \"&'Signature Page'!N9&\",  \"&'Signature Page'!N10&\", \"&'Signature Page'!N11","v":"SR 999/Fake Project Title,  Work Order # XL1234,  WIN # A12345A, PIN # B12345B & C12345C"}]
["Lanes"]
["Element - Main","Element - Sub","Design Manual\nSection","Element Changed","Location","DM Requirement","Project Requirement","Design Manual Met?","Document Type","Notes"]
["General"]
["Frontage Road","Separation Distance","1210.03(2)"]
["Number of Lanes","General","1210.04(1)\n1210.04(2)"]
{"$rows_left_out":37}
{"sheet":"Median","index":16,"n_rows":41,"n_cols":10,"rows_kept":41,"cut":false,"hidden":true,"merged":[[1,0,1,9],[3,0,3,9],[31,0,31,9],[13,0,13,9]]}
[{"$f":"'Signature Page'!N3& \",  \"&'Signature Page'!N9&\",  \"&'Signature Page'!N10&\", \"&'Signature Page'!N11","v":"SR 999/Fake Project Title,  Work Order # XL1234,  WIN # A12345A, PIN # B12345B & C12345C"}]
["Medians"]
["Element - Main","Element - Sub","Design Manual\nSection","Element Changed","Location","DM Requirement","Project Requirement","Design Manual Met?","Document Type","Notes"]
["General"]
["Depressed Median","Rollover","Exhibit 1239-16, Note [4]",null,null,null,null,null,null,"Should be Exhibit 1239-16, Note [4]"]
["Lateral Clearance","Width","Exhibit 1239-11"]
{"$rows_left_out":36}
{"sheet":"Pedestrian","index":17,"n_rows":145,"n_cols":10,"rows_kept":145,"cut":false,"hidden":true,"merged":[[45,0,45,9],[1,0,1,9],[3,0,3,9],[9,0,9,9],[19,0,19,9],[33,0,33,9],[120,0,120,9],[125,0,125,9],[135,0,135,9],[53,0,53,9],[75,0,75,9],[81,0,81,9],[91,0,91,9],[101,0,101,9],[107,0,107,9]]}
[{"$f":"'[1]Signature Page'!N3& \",  \"&'[1]Signature Page'!N9&\",  \"&'[1]Signature Page'!N10&\", \"&'[1]Signature Page'!N11","v":"SR 999/Fake Project Title,  Work Order # XL1234,  WIN # A12345A, PIN # B12345B & C12345C"}]
["Pedestrian Facilities"]
["Element - Main","Element - Sub","Design Manual\nSection","Element Changed","Location","DM Requirement","Project Requirement","Design Manual Met?","Document Type","Notes"]
["General"]
["Alteration Project","Scope of Work","1510.05(2)"]
["Jurisdiction",null,"1510.04(2)"]
{"$rows_left_out":140}
{"sheet":"Ramps","index":18,"n_rows":58,"n_cols":10,"rows_kept":58,"cut":false,"hidden":true,"merged":[[3,0,3,9],[1,0,1,9],[44,0,44,9],[35,0,35,9],[29,0,29,9],[25,0,25,9],[19,0,19,9]]}
[{"$f":"'Signature Page'!N3& \",  \"&'Signature Page'!N9&\",  \"&'Signature Page'!N10&\", \"&'Signature Page'!N11","v":"SR 999/Fake Project Title,  Work Order # XL1234,  WIN # A12345A, PIN # B12345B & C12345C"}]
["On-Ramps & Off-Ramps"]
["Element - Main","Element - Sub","Design Manual\nSection","Element Changed","Location","DM Requirement","Project Requirement","Design Manual Met?","Document Type","Notes"]
["General"]
["C-D Roads","Design Speed","1360.03(1)"]
["Existing Ramps","Design Speed","1360.03(1)"]
{"$rows_left_out":53}
{"sheet":"Rumble Strips","index":19,"n_rows":26,"n_cols":10,"rows_kept":26,"cut":false,"hidden":true,"merged":[[3,0,3,9],[1,0,1,9]]}
[{"$f":"'Signature Page'!N3& \",  \"&'Signature Page'!N9&\",  \"&'Signature Page'!N10&\", \"&'Signature Page'!N11","v":"SR 999/Fake Project Title,  Work Order # XL1234,  WIN # A12345A, PIN # B12345B & C12345C"}]
["Rumble Strips & Rumble Stripes"]
["Element - Main","Element - Sub","Design Manual\nSection","Element Changed","Location","DM Requirement","Project Requirement","Design Manual Met?","Document Type","Notes"]
["General"]
[" Shoulder Rumble Strip"," Design Details","Standard Plan M-60.10\nStandard Plan M-60.20"]
["Bridges",null,"1600.05(1)"]
{"$rows_left_out":21}
{"sheet":"Shared-Use Path","index":20,"n_rows":53,"n_cols":10,"rows_kept":53,"cut":false,"hidden":true,"merged":[[1,0,1,9],[3,0,3,9]]}
[{"$f":"'Signature Page'!N3& \",  \"&'Signature Page'!N9&\",  \"&'Signature Page'!N10&\", \"&'Signature Page'!N11","v":"SR 999/Fake Project Title,  Work Order # XL1234,  WIN # A12345A, PIN # B12345B & C12345C"}]
["Shared-Use Path"]
["Element - Main","Element - Sub","Design Manual\nSection","Element Changed","Location","DM Requirement","Project Requirement","Design Manual Met?","Document Type","Notes"]
["General"]
["At-Grade Railroad Crossing","Angle","1515.03(2)"]
["At-Grade Railroad Crossing","Signing","1515.03(2)"]
{"$rows_left_out":48}
{"sheet":"Shoulder","index":21,"n_rows":21,"n_cols":10,"rows_kept":21,"cut":false,"hidden":true,"merged":[[1,0,1,9],[3,0,3,9]]}
[{"$f":"'Signature Page'!N3& \",  \"&'Signature Page'!N9&\",  \"&'Signature Page'!N10&\", \"&'Signature Page'!N11","v":"SR 999/Fake Project Title,  Work Order # XL1234,  WIN # A12345A, PIN # B12345B & C12345C"}]
["Shoulder"]
["Element - Main","Element - Sub","Design Manual\nSection","Element Changed","Location","DM Requirement","Project Requirement","Design Manual Met?","Document Type","Notes"]
["General"]
["Inside","Width","1239.02(1)\nExhibit 1239-1\n1239.02(1)(a)"]
["Outside","Width","1239.02(1)\nExhibit 1239-1\n1239.02(1)(a)\n1610.04(2)"]
{"$rows_left_out":16}
{"sheet":"Side Slope","index":22,"n_rows":18,"n_cols":10,"rows_kept":18,"cut":false,"hidden":true,"merged":[[3,0,3,9],[1,0,1,9]]}
[{"$f":"'Signature Page'!N3& \",  \"&'Signature Page'!N9&\",  \"&'Signature Page'!N10&\", \"&'Signature Page'!N11","v":"SR 999/Fake Project Title,  Work Order # XL1234,  WIN # A12345A, PIN # B12345B & C12345C"}]
["Side Slopes"]
["Element - Main","Element - Sub","Design Manual\nSection","Element Changed","Location","DM Requirement","Project Requirement","Design Manual Met?","Document Type","Notes"]
["General"]
["Bridge Ends","Multiple","1239.03(2)\nExhibit 1239-6"]
["Cut","Rock Cuts",1239.04]
{"$rows_left_out":13}
{"sheet":"Roundabout","index":23,"n_rows":56,"n_cols":10,"rows_kept":56,"cut":false,"hidden":true,"merged":[[1,0,1,9],[3,0,3,9],[14,0,14,9],[48,0,48,9]]}
[{"$f":"'Signature Page'!N3& \",  \"&'Signature Page'!N9&\",  \"&'Signature Page'!N10&\", \"&'Signature Page'!N11","v":"SR 999/Fake Project Title,  Work Order # XL1234,  WIN # A12345A, PIN # B12345B & C12345C"}]
["Roundabouts"]
["Element - Main","Element - Sub","Design Manual\nSection","Element Changed","Location","DM Requirement","Project Requirement","Design Manual Met?","Document Type","Notes"]
["General"]
["Capacity Analysis",null,1320.03]
["Central Island","Landscape Coordination","1320.04(2)(c)\n950.03"]
{"$rows_left_out":51}
{"sheet":"Signals, Illum, ITS","index":24,"n_rows":24,"n_cols":10,"rows_kept":24,"cut":false,"hidden":true,"merged":[[1,0,1,9],[3,0,3,9],[11,0,11,9],[20,0,20,9]]}
[{"$f":"'Signature Page'!N3& \",  \"&'Signature Page'!N9&\",  \"&'Signature Page'!N10&\", \"&'Signature Page'!N11","v":"SR 999/Fake Project Title,  Work Order # XL1234,  WIN # A12345A, PIN # B12345B & C12345C"}]
["Signals, Illumination, & ITS"]
["Element - Main","Element - Sub","Design Manual\nSection","Element Changed","Location","DM Requirement","Project Requirement","Design Manual Met?","Document Type","Notes"]
["Illumination"]
["Light Level Criteria","Required Illumination","1040.10"]
["Light Level Criteria","Lighting Analysis","1040.10"]
{"$rows_left_out":19}
{"sheet":"Signing","index":25,"n_rows":18,"n_cols":10,"rows_kept":18,"cut":false,"hidden":true,"merged":[[1,0,1,9],[3,0,3,9]]}
[{"$f":"'Signature Page'!N3& \",  \"&'Signature Page'!N9&\",  \"&'Signature Page'!N10&\", \"&'Signature Page'!N11","v":"SR 999/Fake Project Title,  Work Order # XL1234,  WIN # A12345A, PIN # B12345B & C12345C"}]
["Signing"]
["Element - Main","Element - Sub","Design Manual\nSection","Element Changed","Location","DM Requirement","Project Requirement","Design Manual Met?","Document Type","Notes"]
["General"]
["Sign Design","Location","1020.02(1)"]
["Sign Design","Longitudinal Placement","1020.02(2)"]
{"$rows_left_out":13}
{"sheet":"Streetside","index":26,"n_rows":21,"n_cols":10,"rows_kept":21,"cut":false,"hidden":true,"merged":[[1,0,1,9],[3,0,3,9]]}
[{"$f":"'Signature Page'!N3& \",  \"&'Signature Page'!N9&\",  \"&'Signature Page'!N10&\", \"&'Signature Page'!N11","v":"SR 999/Fake Project Title,  Work Order # XL1234,  WIN # A12345A, PIN # B12345B & C12345C"}]
["Streetside"]
["Element - Main","Element - Sub","Design Manual\nSection","Element Changed","Location","DM Requirement","Project Requirement","Design Manual Met?","Document Type","Notes"]
["General"]
["Parking","Municipal Code",1238.02]
["Parking","Width",1238.02]
{"$rows_left_out":16}
{"sheet":"Vert Align","index":27,"n_rows":26,"n_cols":10,"rows_kept":26,"cut":false,"hidden":true,"merged":[[18,0,18,9],[3,0,3,9],[1,0,1,9]]}
[{"$f":"'Signature Page'!N3& \",  \"&'Signature Page'!N9&\",  \"&'Signature Page'!N10&\", \"&'Signature Page'!N11","v":"SR 999/Fake Project Title,  Work Order # XL1234,  WIN # A12345A, PIN # B12345B & C12345C"}]
["Vertical Alignment"]
["Element - Main","Element - Sub","Design Manual\nSection","Element Changed","Location","DM Requirement","Project Requirement","Design Manual Met?","Document Type","Notes"]
["General"]
["General Design Principle","Multiple","1220.02(1)"]
["General Design Principle","Coordination with Horizontal Curve",1220.03]
{"$rows_left_out":21}
{"sheet":"Work Zone","index":28,"n_rows":13,"n_cols":10,"rows_kept":13,"cut":false,"hidden":true,"merged":[[1,0,1,9],[3,0,3,9]]}
[{"$f":"'Signature Page'!N3& \",  \"&'Signature Page'!N9&\",  \"&'Signature Page'!N10&\", \"&'Signature Page'!N11","v":"SR 999/Fake Project Title,  Work Order # XL1234,  WIN # A12345A, PIN # B12345B & C12345C"}]
["Work Zone"]
["Element - Main","Element - Sub","Design Manual\nSection","Element Changed","Location","DM Requirement","Project Requirement","Design Manual Met?","Document Type","Notes"]
["General"]
["Work Zone Design Strategy","Meeting",1010.02]
["Work Zone Design Strategy","Statement",1010.02]
{"$rows_left_out":8}
{"sheet":"Blank","index":29,"n_rows":4,"n_cols":10,"rows_kept":4,"cut":false,"hidden":true,"merged":[[3,0,3,9],[1,0,1,9]]}
[{"$f":"'Signature Page'!N3& \",  \"&'Signature Page'!N9&\",  \"&'Signature Page'!N10&\", \"&'Signature Page'!N11","v":"SR 999/Fake Project Title,  Work Order # XL1234,  WIN # A12345A, PIN # B12345B & C12345C"}]
["Blank"]
["Element - Main","Element - Sub","Design Manual\nSection","Element Changed","Location","DM Requirement","Project Requirement","Design Manual Met?","Document Type","Notes"]
["General"]

{"sheet":"Form Control","index":30,"n_rows":32,"n_cols":6,"rows_kept":32,"cut":false,"hidden":true,"merged":[[1,4,1,5]]}
["This tab includes form control items."]
[null,null,null,null,"These two columns are used for the printing macro.  Do not change."]
["Yes/No","Super Chart","Design Document Type","Choose Region/Program","Sheetnames","Modified?"]
["Yes","Choose One","Design Analysis","Eastern Region, Spokane, Washington","Instructions","No"]
["No","emax = 6%\nExhibit 1250-6","Design Decision","I-405/SR 167 Program, Bellevue, Washington","Guide","No"]
["N/A","emax = 8%\nExhibit 1250-5","N/A","NC Region, Wenatchee, Washington","Project Info","No"]
{"$rows_left_out":26}